Target
C-C chemokine receptor type 4
Ligand
BDBM50244126
Substrate
Meas. Tech.
ChEMBL_491885 (CHEMBL946415)
IC50
13±n/a nM
Citation
 Yokoyama, KIshikawa, NIgarashi, SKawano, NHattori, KMiyazaki, TOgino, SMatsumoto, YTakeuchi, MOhta, M Discovery of potent CCR4 antagonists: Synthesis and structure-activity relationship study of 2,4-diaminoquinazolines. Bioorg Med Chem 16:7021-32 (2008)  
Target
Name:
C-C chemokine receptor type 4
Synonyms:
C-C CKR-4 C-C chemokine receptor type 4 (CCR4) CCR-4 CCR4_HUMAN CMKBR4 | K5-5
Type:
Enzyme
Mol. Mass.:
41406.41
Organism:
Homo sapiens (Human)
Description:
P51679
Residue:
360
  
Inhibitor
Name:
BDBM50244126
Synonyms:
CHEMBL459464 | N-cycloheptyl-7-methoxy-2-(4-(pyrrolidin-1-yl)piperidin-1-yl)quinazolin-4-amine
Type:
Small organic molecule
Emp. Form.:
C25H37N5O
Mol. Mass.:
423.5942
SMILES:
COc1ccc2c(NC3CCCCCC3)nc(nc2c1)N1CCC(CC1)N1CCCC1
: