Target
Polyunsaturated fatty acid 5-lipoxygenase
Ligand
BDBM32020
Substrate
Meas. Tech.
ChEMBL_487246 (CHEMBL1018366)
IC50
35000±n/a nM
Citation
 Chowdhury, MAChen, HAbdellatif, KRDong, YPetruk, KCKnaus, EE Synthesis and biological evaluation of 1-(benzenesulfonamido)-2-[5-(N-hydroxypyridin-2(1H)-one)]acetylene regioisomers: a novel class of 5-lipoxygenase inhibitors. Bioorg Med Chem Lett 18:4195-8 (2008)  
Target
Name:
Polyunsaturated fatty acid 5-lipoxygenase
Synonyms:
5-LO 5-Lipoxygenase (5-LO) 5-Lipoygenase ALOX5 LOG5 | LOX5_HUMAN
Type:
Enzyme
Mol. Mass.:
77972.74
Organism:
Homo sapiens (Human)
Description:
Recombinant protein was purified from E. coli lysate. After ammonium sulfate precipitation and subsequent steps, the supernatant (S100) was used for 5-LO activity assay.
Residue:
674
  
Inhibitor
Name:
BDBM32020
Synonyms:
4-[4-(3,4-dihydroxyphenyl)-2,3-dimethyl-butyl]pyrocatechol 4-[4-[3,4-bis(oxidanyl)phenyl]-2,3-dimethyl-butyl]benzene-1,2-diol CHEMBL52 MLS000069451 Nordihydroguaiaretic acid (NDGA) US10857082, Compound 2.18 | cid_4534
Type:
Small organic molecule
Emp. Form.:
C18H22O4
Mol. Mass.:
302.3649
SMILES:
CC(Cc1ccc(O)c(O)c1)C(C)Cc1ccc(O)c(O)c1
: