Target
Beta-2 adrenergic receptor
Ligand
BDBM50243110
Substrate
Meas. Tech.
ChEMBL_492277 (CHEMBL947245)
EC50
>10000±n/a nM
Citation
 Imanishi, MItou, SWashizuka, KHamashima, HNakajima, YAraki, TTomishima, YSakurai, MMatsui, SImamura, EUeshima, KYamamoto, TYamamoto, NIshikawa, HNakano, KUnami, NHamada, KMatsumura, YTakamura, FHattori, K Discovery of a novel series of biphenyl benzoic acid derivatives as highly potent and selective human beta3 adrenergic receptor agonists with good oral bioavailability. Part II. J Med Chem 51:4002-20 (2008)  
Target
Name:
Beta-2 adrenergic receptor
Synonyms:
ADRB2 ADRB2_HUMAN Beta-2 adrenoceptor | Beta-2 adrenoreceptor
Type:
Mol. Mass.:
46461.69
Organism:
Homo sapiens (Human)
Description:
P07550
Residue:
413
  
Inhibitor
Name:
BDBM50243110
Synonyms:
4-(2-{[(2R)-2-(6-Amino-3-pyridinyl)-2-hydroxyethyl]amino}ethyl)-3-isopropoxy-4-biphenylcarboxylic acid | CHEMBL488223
Type:
Small organic molecule
Emp. Form.:
C25H29N3O4
Mol. Mass.:
435.5155
SMILES:
CC(C)Oc1cc(ccc1C(O)=O)-c1ccc(CCNC[C@H](O)c2ccc(N)nc2)cc1
: