Target
Beta-3 adrenergic receptor
Ligand
BDBM50236182
Substrate
Meas. Tech.
ChEMBL_492276 (CHEMBL947244)
EC50
4.8±n/a nM
Citation
 Imanishi, MItou, SWashizuka, KHamashima, HNakajima, YAraki, TTomishima, YSakurai, MMatsui, SImamura, EUeshima, KYamamoto, TYamamoto, NIshikawa, HNakano, KUnami, NHamada, KMatsumura, YTakamura, FHattori, K Discovery of a novel series of biphenyl benzoic acid derivatives as highly potent and selective human beta3 adrenergic receptor agonists with good oral bioavailability. Part II. J Med Chem 51:4002-20 (2008)  
Target
Name:
Beta-3 adrenergic receptor
Synonyms:
ADRB3 ADRB3_HUMAN Beta-2 adrenergic receptor and beta-3 adrenergic receptor Beta-3 adrenoreceptor | adrenergic Beta3
Type:
G Protein-Coupled Receptor (GPCR)
Mol. Mass.:
43534.88
Organism:
Homo sapiens (Human)
Description:
Residue:
408
  
Inhibitor
Name:
BDBM50236182
Synonyms:
(R)-4'-(2-(2-(3-chlorophenyl)-2-hydroxyethylamino)ethyl)-3-methoxybiphenyl-4-carboxylic acid 4-(2-{[(2R)-2-(3-chlorophenyl)-2-hydroxyethyl]amino}-ethyl)-3-methoxy-4-biphenyl-4-carboxylic acid | CHEMBL272383
Type:
Small organic molecule
Emp. Form.:
C24H24ClNO4
Mol. Mass.:
425.905
SMILES:
COc1cc(ccc1C(O)=O)-c1ccc(CCNC[C@H](O)c2cccc(Cl)c2)cc1
: