Target
Beta-3 adrenergic receptor
Ligand
BDBM50243544
Substrate
Meas. Tech.
ChEMBL_492276 (CHEMBL947244)
EC50
0.059000±n/a nM
Citation
 Imanishi, MItou, SWashizuka, KHamashima, HNakajima, YAraki, TTomishima, YSakurai, MMatsui, SImamura, EUeshima, KYamamoto, TYamamoto, NIshikawa, HNakano, KUnami, NHamada, KMatsumura, YTakamura, FHattori, K Discovery of a novel series of biphenyl benzoic acid derivatives as highly potent and selective human beta3 adrenergic receptor agonists with good oral bioavailability. Part II. J Med Chem 51:4002-20 (2008)  
Target
Name:
Beta-3 adrenergic receptor
Synonyms:
ADRB3 ADRB3_HUMAN Beta-2 adrenergic receptor and beta-3 adrenergic receptor Beta-3 adrenoreceptor | adrenergic Beta3
Type:
G Protein-Coupled Receptor (GPCR)
Mol. Mass.:
43534.88
Organism:
Homo sapiens (Human)
Description:
Residue:
408
  
Inhibitor
Name:
BDBM50243544
Synonyms:
4-(2-{[(2R)-2-(6-Amino-3-pyridinyl)-2-hydroxyethyl]amino}ethoxy)-3-isobutyl-4-biphenylcarboxylic acid | CHEMBL459646
Type:
Small organic molecule
Emp. Form.:
C26H31N3O4
Mol. Mass.:
449.542
SMILES:
CC(C)Cc1cc(ccc1C(O)=O)-c1ccc(OCCNC[C@H](O)c2ccc(N)nc2)cc1
: