Target
Glycogen phosphorylase, liver form
Ligand
BDBM50243601
Substrate
Meas. Tech.
ChEMBL_491654 (CHEMBL946372)
IC50
120±n/a nM
Citation
 Evans, KALi, YHCoppo, FTGraybill, TLCichy-Knight, MPatel, MGale, JLi, HThrall, SHTew, DTavares, FThomson, SAWeiel, JEBoucheron, JAClancy, DCEpperly, AHGolden, PL Amino acid anthranilamide derivatives as a new class of glycogen phosphorylase inhibitors. Bioorg Med Chem Lett 18:4068-71 (2008)  
Target
Name:
Glycogen phosphorylase, liver form
Synonyms:
Glycogen Phosphorylase (PYGL) Liver glycogen phosphorylase PYGL_HUMAN
Type:
Homodimer
Mol. Mass.:
97153.98
Organism:
Homo sapiens (Human)
Description:
Dimers associate into a tetramer to form the enzymatically active phosphorylase A.
Residue:
847
  
Inhibitor
Name:
BDBM50243601
Synonyms:
(S)-2-cyclohexyl-2-(2-(3-(2,6-dimethylphenyl)ureido)-2-naphthamido)acetic acid CHEMBL459858
Type:
Small organic molecule
Emp. Form.:
C28H31N3O4
Mol. Mass.:
473.5634
SMILES:
Cc1cccc(C)c1NC(=O)Nc1cc2ccccc2cc1C(=O)N[C@@H](C1CCCCC1)C(O)=O
: