Target
Dipeptidyl peptidase 8
Ligand
BDBM50243687
Substrate
Meas. Tech.
ChEMBL_492001 (CHEMBL938684)
IC50
21±n/a nM
Citation
 Van der Veken, PDe Meester, IDubois, VSoroka, AVan Goethem, SMaes, MBBrandt, ILambeir, AMChen, XHaemers, AScharpé, SAugustyns, K Inhibitors of dipeptidyl peptidase 8 and dipeptidyl peptidase 9. Part 1: identification of dipeptide derived leads. Bioorg Med Chem Lett 18:4154-8 (2008)  
Target
Name:
Dipeptidyl peptidase 8
Synonyms:
DPP8 DPRP-1 Dipeptidyl peptidase 8 (DPP-8) Dipeptidyl peptidase 8/9 Dipeptidyl peptidase VIII Prolyl dipeptidase DPP8
Type:
Enzyme
Mol. Mass.:
103342.62
Organism:
Homo sapiens (Human)
Description:
Q6V1X1
Residue:
898
  
Inhibitor
Name:
BDBM50243687
Synonyms:
CHEMBL471747 | benzyl (S)-5-amino-6-((2S,4S)-4-azido-2-cyanopyrrolidin-1-yl)-6-oxohexylcarbamate
Type:
Small organic molecule
Emp. Form.:
C19H25N7O3
Mol. Mass.:
399.4469
SMILES:
N[C@@H](CCCCNC(=O)OCc1ccccc1)C(=O)N1C[C@H](C[C@H]1C#N)N=[N+]=[N-]
: