Target
Dipeptidyl peptidase 9
Ligand
BDBM50243496
Substrate
Meas. Tech.
ChEMBL_492002 (CHEMBL938685)
IC50
>100000±n/a nM
Citation
 Van der Veken, PDe Meester, IDubois, VSoroka, AVan Goethem, SMaes, MBBrandt, ILambeir, AMChen, XHaemers, AScharpé, SAugustyns, K Inhibitors of dipeptidyl peptidase 8 and dipeptidyl peptidase 9. Part 1: identification of dipeptide derived leads. Bioorg Med Chem Lett 18:4154-8 (2008)  
Target
Name:
Dipeptidyl peptidase 9
Synonyms:
DPP9 DPRP-2 Dipeptidyl peptidase 9 (DDP9) Dipeptidyl peptidase 9 (DPP9) Dipeptidyl peptidase IX Dipeptidyl peptidase-like protein 9
Type:
Enzyme
Mol. Mass.:
98260.70
Organism:
Homo sapiens (Human)
Description:
Q86TI2
Residue:
863
  
Inhibitor
Name:
BDBM50243496
Synonyms:
(2S,3S)-2-amino-1-(azetidin-1-yl)-3-methylpentan-1-one | CHEMBL461496
Type:
Small organic molecule
Emp. Form.:
C9H18N2O
Mol. Mass.:
170.252
SMILES:
CC[C@H](C)[C@H](N)C(=O)N1CCC1
: