Target
Sodium-dependent serotonin transporter
Ligand
BDBM50010858
Substrate
Meas. Tech.
ChEMBL_487423 (CHEMBL1020017)
IC50
292±n/a nM
Citation
 Mahaney, PEGavrin, LKTrybulski, EJStack, GPVu, TACohn, STYe, FBelardi, JKSantilli, AASabatucci, JPLeiter, JJohnston, GHBray, JABurroughs, KDCosmi, SALeventhal, LKoury, EJZhang, YMugford, CAHo, DMRosenzweig-Lipson, SJPlatt, BSmith, VADeecher, DC Structure-activity relationships of the cycloalkanol ethylamine scaffold: discovery of selective norepinephrine reuptake inhibitors. J Med Chem 51:4038-49 (2008)  
Target
Name:
Sodium-dependent serotonin transporter
Synonyms:
5-HT Transporter 5HTT SC6A4_HUMAN SLC6A4 Serotonin transporter (5HTT) Sodium-dependent serotonin transporter (SERT) | Solute carrier family 6 member 4
Type:
Multi-pass membrane protein
Mol. Mass.:
70322.51
Organism:
Homo sapiens (Human)
Description:
P31645
Residue:
630
  
Inhibitor
Name:
BDBM50010858
Synonyms:
1-(1-(3-chlorophenyl)-2-(dimethylamino)ethyl)cyclohexanol CHEMBL101899
Type:
Small organic molecule
Emp. Form.:
C16H24ClNO
Mol. Mass.:
281.821
SMILES:
CN(C)CC(c1cccc(Cl)c1)C1(O)CCCCC1
: