Target
Adenosine kinase
Ligand
BDBM50252116
Substrate
Meas. Tech.
ChEMBL_491790 (CHEMBL937861)
Ki
7200±n/a nM
Citation
 Kim, YASharon, AChu, CKRais, RHAl Safarjalani, ONNaguib, FNel Kouni, MH Structure-activity relationships of 7-deaza-6-benzylthioinosine analogues as ligands of Toxoplasma gondii adenosine kinase. J Med Chem 51:3934-45 (2008)  
Target
Name:
Adenosine kinase
Synonyms:
ADK_TOXGO | AK
Type:
PROTEIN
Mol. Mass.:
38353.04
Organism:
Toxoplasma gondii
Description:
ChEMBL_629062
Residue:
363
  
Inhibitor
Name:
BDBM50252116
Synonyms:
4-[(2-Chloro-6-fluorobenzyl)thio]-7-(beta-D-ribofuranosyl)-7Hpyrrolo[2,3-d]pyrimidine | CHEMBL481307
Type:
Small organic molecule
Emp. Form.:
C18H17ClFN3O4S
Mol. Mass.:
425.862
SMILES:
OC[C@H]1O[C@H]([C@H](O)[C@@H]1O)n1ccc2c(SCc3c(F)cccc3Cl)ncnc12
: