Target
Cytochrome P450 3A4
Ligand
BDBM50252195
Substrate
Meas. Tech.
ChEMBL_487712 (CHEMBL1022737)
IC50
3.9±n/a nM
Citation
 Zimmermann, KWittman, MDSaulnier, MGVelaparthi, ULangley, DRSang, XFrennesson, DCarboni, JLi, AGreer, AGottardis, MAttar, RMYang, ZBalimane, PDiscenza, LNVyas, D Balancing oral exposure with Cyp3A4 inhibition in benzimidazole-based IGF-IR inhibitors. Bioorg Med Chem Lett 18:4075-80 (2008)  
Target
Name:
Cytochrome P450 3A4
Synonyms:
Albendazole monooxygenase CP3A4_HUMAN CYP3A4 CYPIIIA4 Cytochrome P450 3A4 (CYP3A4) Nifedipine oxidase Taurochenodeoxycholate 6-alpha-hydroxylase
Type:
Enzyme
Mol. Mass.:
57349.57
Organism:
Homo sapiens (Human)
Description:
Residue:
503
  
Inhibitor
Name:
BDBM50252195
Synonyms:
(S)-4-(2-(3-chlorophenyl)-2-hydroxyethylamino)-3-(6-(4-(dimethylamino)piperidin-1-yl)-4-methyl-1H-benzo[d]imidazol-2-yl)pyridin-2(1H)-one | CHEMBL519300
Type:
Small organic molecule
Emp. Form.:
C28H33ClN6O2
Mol. Mass.:
521.054
SMILES:
CN(C)C1CCN(CC1)c1cc(C)c2nc([nH]c2c1)-c1c(NC[C@@H](O)c2cccc(Cl)c2)cc[nH]c1=O
: