Target
Inosine-5'-monophosphate dehydrogenase 2
Ligand
BDBM50263247
Substrate
Meas. Tech.
ChEMBL_490552 (CHEMBL981158)
Ki
4000±n/a nM
Citation
 Chen, LPetrelli, ROlesiak, MWilson, DJLabello, NPPankiewicz, KW Bis(sulfonamide) isosters of mycophenolic adenine dinucleotide analogues: inhibition of inosine monophosphate dehydrogenase. Bioorg Med Chem 16:7462-9 (2008)  
Target
Name:
Inosine-5'-monophosphate dehydrogenase 2
Synonyms:
IMDH2_HUMAN IMPD 2 IMPDH-II Inosine 5'-monophosphate dehydrogenase II (IMPDH II) Inosine-5 -monophosphate dehydrogenase 2 | Inosine-5'-monophosphate dehydrogenase (IMPDH)
Type:
Enzyme
Mol. Mass.:
55806.87
Organism:
Homo sapiens (Human)
Description:
Recombinant IMPDH2 expressed in E. coli.
Residue:
514
  
Inhibitor
Name:
BDBM50263247
Synonyms:
CHEMBL476562 | Mycophenolic bis(sulfonamide)
Type:
Small organic molecule
Emp. Form.:
C13H18N2O8S2
Mol. Mass.:
394.421
SMILES:
COc1c(C)c2COC(=O)c2c(O)c1CCNS(=O)(=O)CS(N)(=O)=O
: