Target
Inosine-5'-monophosphate dehydrogenase 2
Ligand
BDBM50263242
Substrate
Meas. Tech.
ChEMBL_490552 (CHEMBL981158)
IC50
18800±n/a nM
Citation
 Chen, LPetrelli, ROlesiak, MWilson, DJLabello, NPPankiewicz, KW Bis(sulfonamide) isosters of mycophenolic adenine dinucleotide analogues: inhibition of inosine monophosphate dehydrogenase. Bioorg Med Chem 16:7462-9 (2008)  
Target
Name:
Inosine-5'-monophosphate dehydrogenase 2
Synonyms:
IMDH2_HUMAN IMPD 2 IMPDH-II Inosine 5'-monophosphate dehydrogenase II (IMPDH II) Inosine-5 -monophosphate dehydrogenase 2 | Inosine-5'-monophosphate dehydrogenase (IMPDH)
Type:
Enzyme
Mol. Mass.:
55806.87
Organism:
Homo sapiens (Human)
Description:
Recombinant IMPDH2 expressed in E. coli.
Residue:
514
  
Inhibitor
Name:
BDBM50263242
Synonyms:
2-{(2R,3R,4S,5R)-5-[({[(2R,3S,4R,5R)-5-(6-Amino-purin-9-yl)-3,4-dihydroxy-tetrahydro-furan-2-ylmethyl]-sulfamoyl}-methanesulfonylamino)-methyl]-3,4-dihydroxy-tetrahydro-furan-2-yl}-thiazole-4-carboxylic acid amide | CHEMBL508103
Type:
Small organic molecule
Emp. Form.:
C20H27N9O11S3
Mol. Mass.:
665.677
SMILES:
NC(=O)c1csc(n1)[C@@H]1O[C@H](CNS(=O)(=O)CS(=O)(=O)NC[C@H]2O[C@H]([C@H](O)[C@@H]2O)n2cnc3c(N)ncnc23)[C@@H](O)[C@H]1O
: