Target
D(2) dopamine receptor
Ligand
BDBM50262788
Substrate
Meas. Tech.
ChEMBL_491035 (CHEMBL982895)
Ki
37.3±n/a nM
Citation
 Siracusa, MASalerno, LModica, MNPittalà, VRomeo, GAmato, MENowak, MBojarski, AJMereghetti, ICagnotto, AMennini, T Synthesis of new arylpiperazinylalkylthiobenzimidazole, benzothiazole, or benzoxazole derivatives as potent and selective 5-HT1A serotonin receptor ligands. J Med Chem 51:4529-38 (2008)  
Target
Name:
D(2) dopamine receptor
Synonyms:
DOPAMINE D2 DOPAMINE D2 Short Dopamine D2 receptor Drd2
Type:
G Protein-Coupled Receptor (GPCR)
Mol. Mass.:
50931.60
Organism:
Rattus norvegicus (rat)
Description:
P61169
Residue:
444
  
Inhibitor
Name:
BDBM50262788
Synonyms:
2-[[4-[4-(2-Methoxyphenyl)-1-piperazinyl]butyl]thio]benzoxazole | CHEMBL514074
Type:
Small organic molecule
Emp. Form.:
C22H27N3O2S
Mol. Mass.:
397.534
SMILES:
COc1ccccc1N1CCN(CCCCSc2nc3ccccc3o2)CC1
: