Target
5-hydroxytryptamine receptor 1A
Ligand
BDBM50262833
Substrate
Meas. Tech.
ChEMBL_491041 (CHEMBL982901)
EC50
1210±n/a nM
Citation
 Siracusa, MASalerno, LModica, MNPittalà, VRomeo, GAmato, MENowak, MBojarski, AJMereghetti, ICagnotto, AMennini, T Synthesis of new arylpiperazinylalkylthiobenzimidazole, benzothiazole, or benzoxazole derivatives as potent and selective 5-HT1A serotonin receptor ligands. J Med Chem 51:4529-38 (2008)  
Target
Name:
5-hydroxytryptamine receptor 1A
Synonyms:
5-HT-1A 5-HT1A 5-hydroxytryptamine receptor 1A (5HT1A) 5ht1a Htr1a Serotonin 1a (5-HT1a) receptor/Adrenergic receptor alpha-1 | Serotonin receptor 1A
Type:
G Protein-Coupled Receptor (GPCR)
Mol. Mass.:
46445.29
Organism:
Rattus norvegicus (rat)
Description:
Binding assays were performed using rat hippocampal membranes.
Residue:
422
  
Inhibitor
Name:
BDBM50262833
Synonyms:
3-amino-6-ethyl-2-(3-(4-(pyrimidin-2-yl)piperazin-1-yl)propylthio)thieno[2,3-d]pyrimidin-4(3H,4aH,7aH)-one | CHEMBL479243
Type:
Small organic molecule
Emp. Form.:
C19H27N7OS2
Mol. Mass.:
433.594
SMILES:
CCC1SC2N=C(SCCCN3CCN(CC3)c3ncccn3)N(N)C(=O)C2=C1
: