Target
Lysosomal alpha-mannosidase
Ligand
BDBM50168995
Substrate
Meas. Tech.
ChEMBL_489067 (CHEMBL987287)
IC50
50±n/a nM
Citation
 Fiaux, HKuntz, DAHoffman, DJanzer, RCGerber-Lemaire, SRose, DRJuillerat-Jeanneret, L Functionalized pyrrolidine inhibitors of human type II alpha-mannosidases as anti-cancer agents: optimizing the fit to the active site. Bioorg Med Chem 16:7337-46 (2008)  
Target
Name:
Lysosomal alpha-mannosidase
Synonyms:
LAMAN MAN2B1 | MANB
Type:
PROTEIN
Mol. Mass.:
113753.32
Organism:
Homo sapiens (Human)
Description:
ChEMBL_1432452
Residue:
1011
  
Inhibitor
Name:
BDBM50168995
Synonyms:
(-)-swainsonine 1S-8AB-OCTAHYDRO-INDOLIZIDINE-1A,2A,8B-TRIOL SWAINSONINE
Type:
Small organic molecule
Emp. Form.:
C8H15NO3
Mol. Mass.:
173.2096
SMILES:
O[C@@H]1CN2CCC[C@@H](O)[C@@H]2[C@@H]1O
: