Target
Lysosomal alpha-mannosidase
Ligand
BDBM50263048
Substrate
Meas. Tech.
ChEMBL_489068 (CHEMBL987288)
IC50
75000±n/a nM
Citation
 Fiaux, HKuntz, DAHoffman, DJanzer, RCGerber-Lemaire, SRose, DRJuillerat-Jeanneret, L Functionalized pyrrolidine inhibitors of human type II alpha-mannosidases as anti-cancer agents: optimizing the fit to the active site. Bioorg Med Chem 16:7337-46 (2008)  
Target
Name:
Lysosomal alpha-mannosidase
Synonyms:
LAMAN MAN2B1 | MANB
Type:
PROTEIN
Mol. Mass.:
113753.32
Organism:
Homo sapiens (Human)
Description:
ChEMBL_1432452
Residue:
1011
  
Inhibitor
Name:
BDBM50263048
Synonyms:
(3R,4R,5R)-3,4-dihydroxy-5-(((R)-2-hydroxy-1-phenylethylamino)methyl)pyrrolidin-2-one CHEMBL476925
Type:
Small organic molecule
Emp. Form.:
C13H18N2O4
Mol. Mass.:
266.293
SMILES:
OC[C@H](NC[C@H]1NC(=O)[C@H](O)[C@@H]1O)c1ccccc1
: