Target
5-hydroxytryptamine receptor 2C
Ligand
BDBM50251648
Substrate
Meas. Tech.
ChEMBL_488674 (CHEMBL988364)
IC50
1.6±n/a nM
Citation
 Park, CMKim, SYPark, WKPark, NSSeong, CM Synthesis and structure-activity relationship of 1H-indole-3-carboxylic acid pyridine-3-ylamides: a novel series of 5-HT2C receptor antagonists. Bioorg Med Chem Lett 18:3844-7 (2008)  
Target
Name:
5-hydroxytryptamine receptor 2C
Synonyms:
5-HT-2C 5-HT2C-INI 5-HTR2C 5-hydroxytryptamine receptor 2C (5-HT-2C) 5HT-1C HTR1C Serotonin (5-HT3) receptor Serotonin Receptor 2C
Type:
G Protein-Coupled Receptor (GPCR)
Mol. Mass.:
51836.79
Organism:
Homo sapiens (Human)
Description:
P28335
Residue:
458
  
Inhibitor
Name:
BDBM50251648
Synonyms:
CHEMBL479952 | N-(6-(pyridin-3-yloxy)pyridin-3-yl)-1H-indole-3-carboxamide
Type:
Small organic molecule
Emp. Form.:
C19H14N4O2
Mol. Mass.:
330.3401
SMILES:
O=C(Nc1ccc(Oc2cccnc2)nc1)c1c[nH]c2ccccc12
: