Target
Neuronal acetylcholine receptor subunit alpha-4
Ligand
BDBM50261762
Substrate
Meas. Tech.
ChEMBL_509574 (CHEMBL1000460)
Ki
0.4±n/a nM
Citation
 Rizzi, LDallanoce, CMatera, CMagrone, PPucci, LGotti, CClementi, FDe Amici, M Epiboxidine and novel-related analogues: a convenient synthetic approach and estimation of their affinity at neuronal nicotinic acetylcholine receptor subtypes. Bioorg Med Chem Lett 18:4651-4 (2008)  
Target
Name:
Neuronal acetylcholine receptor subunit alpha-4
Synonyms:
ACHA4_RAT Cholinergic, Nicotinic Alpha4Beta2 Chrna4 Neuronal acetylcholine receptor (alpha4beta2 nAChR) Neuronal acetylcholine receptor subunit alpha 4 beta 2 | Neuronal acetylcholine receptor subunit alpha-4
Type:
Enzyme
Mol. Mass.:
70196.44
Organism:
Rattus norvegicus (Rat)
Description:
P09483
Residue:
630
  
Inhibitor
Name:
BDBM50261762
Synonyms:
(+/-)-exo-2-(3-methylisoxazol-5-yl)-7-aza-bicyclo[2.2.1]heptane | CHEMBL503604
Type:
Small organic molecule
Emp. Form.:
C10H14N2O
Mol. Mass.:
178.231
SMILES:
Cc1cc(on1)[C@H]1C[C@H]2CC[C@H]1N2
: