Target
Acetylcholinesterase
Ligand
BDBM50273182
Substrate
Meas. Tech.
ChEMBL_509818 (CHEMBL1000499)
IC50
4.16±n/a nM
Citation
 Shen, YSheng, RZhang, JHe, QYang, BHu, Y 2-Phenoxy-indan-1-one derivatives as acetylcholinesterase inhibitors: a study on the importance of modifications at the side chain on the activity. Bioorg Med Chem 16:7646-53 (2008)  
Target
Name:
Acetylcholinesterase
Synonyms:
ACES_RAT Acetylcholinesterase and butyrylcholinesterase (AChE and BChE) Acetylcholinesterase, AChE | Ache
Type:
Enzyme
Mol. Mass.:
68193.62
Organism:
Rattus norvegicus (rat)
Description:
P37136
Residue:
614
  
Inhibitor
Name:
BDBM50273182
Synonyms:
5,6-Dimethoxy-2-(4-(3-(pyrrolidin-1-yl)propanoyl)phenoxy)-indan-1-one | CHEMBL518384
Type:
Small organic molecule
Emp. Form.:
C24H27NO5
Mol. Mass.:
409.4749
SMILES:
COc1cc2CC(Oc3ccc(cc3)C(=O)CCN3CCCC3)C(=O)c2cc1OC
: