Target
Hydroxycarboxylic acid receptor 2
Ligand
BDBM50273099
Substrate
Meas. Tech.
ChEMBL_509910 (CHEMBL1002180)
EC50
400±n/a nM
Citation
 Semple, GSkinner, PJGharbaoui, TShin, YJJung, JKCherrier, MCWebb, PJTamura, SYBoatman, PDSage, CRSchrader, TOChen, RColletti, SLTata, JRWaters, MGCheng, KTaggart, AKCai, TQCarballo-Jane, EBehan, DPConnolly, DTRichman, JG 3-(1H-tetrazol-5-yl)-1,4,5,6-tetrahydro-cyclopentapyrazole (MK-0354): a partial agonist of the nicotinic acid receptor, G-protein coupled receptor 109a, with antilipolytic but no vasodilatory activity in mice. J Med Chem 51:5101-8 (2008)  
Target
Name:
Hydroxycarboxylic acid receptor 2
Synonyms:
Gpr109 Gpr109b HM74 nicotinic acid GPCR Niacr1 | Pumag
Type:
PROTEIN
Mol. Mass.:
41418.01
Organism:
Mus musculus
Description:
ChEMBL_820676
Residue:
360
  
Inhibitor
Name:
BDBM50273099
Synonyms:
3-(1H-tetrazol-5-yl)-1,4,5,6-tetrahydrocyclopenta[c]pyrazole CHEMBL456145 | MK-0354
Type:
Small organic molecule
Emp. Form.:
C7H8N6
Mol. Mass.:
176.1786
SMILES:
C1Cc2[nH]nc(c2C1)-c1nnn[nH]1
: