Target
Kappa-type opioid receptor
Ligand
BDBM50272328
Substrate
Meas. Tech.
ChEMBL_510227 (CHEMBL1005605)
Ki
0.210000±n/a nM
Citation
 Fulton, BSKnapp, BIBidlack, JMNeumeyer, JL Synthesis and pharmacological evaluation of hydrophobic esters and ethers of butorphanol at opioid receptors. Bioorg Med Chem Lett 18:4474-6 (2008)  
Target
Name:
Kappa-type opioid receptor
Synonyms:
K-OR-1 Kappa-opioid receptor (KOR) Kappa-type opioid receptor (KOR) OPIATE Kappa OPRK1 kappa opioid receptor (KOR)
Type:
G Protein-Coupled Receptor (GPCR)
Mol. Mass.:
42648.76
Organism:
Homo sapiens (Human)
Description:
P41145
Residue:
380
  
Inhibitor
Name:
BDBM50272328
Synonyms:
(1S,9R,10S)-17-(cyclobutylmethyl)-10-hydroxy-17-azatetracyclo[7.5.3.0^{1,10}.0^{2,7}]heptadeca-2(7),3,5-trien-4-yl 2-(4-methoxyphenyl)acetate hydrochloride | CHEMBL521543
Type:
Small organic molecule
Emp. Form.:
C30H37NO4
Mol. Mass.:
475.6191
SMILES:
COc1ccc(CC(=O)Oc2ccc3C[C@H]4N(CC5CCC5)CC[C@@]5(CCCC[C@@]45O)c3c2)cc1
: