Target
Cystic fibrosis transmembrane conductance regulator
Ligand
BDBM50244988
Substrate
Meas. Tech.
ChEMBL_511651 (CHEMBL976298)
IC50
24000±n/a nM
Citation
 Sonawane, NDVerkman, AS Thiazolidinone CFTR inhibitors with improved water solubility identified by structure-activity analysis. Bioorg Med Chem 16:8187-95 (2008)  
Target
Name:
Cystic fibrosis transmembrane conductance regulator
Synonyms:
ABCC7 CFTR Channel conductance-controlling ATPase | cAMP-dependent chloride channel
Type:
Enzyme Catalytic Domain
Mol. Mass.:
168171.30
Organism:
Homo sapiens (Human)
Description:
gi_90421313
Residue:
1480
  
Inhibitor
Name:
BDBM50244988
Synonyms:
5-(4-hydroxybenzylidene)-2-thioxo-3-(3-(trifluoromethyl)phenyl)thiazolidin-4-one | CHEMBL513552
Type:
Small organic molecule
Emp. Form.:
C17H10F3NO2S2
Mol. Mass.:
381.392
SMILES:
Oc1ccc(\C=C2/SC(=S)N(C2=O)c2cccc(c2)C(F)(F)F)cc1
: