Target
Aminopeptidase N
Ligand
BDBM50247539
Substrate
Meas. Tech.
ChEMBL_511264 (CHEMBL996090)
IC50
141900±n/a nM
Citation
 Cheng, XCWang, QFang, HTang, WXu, WF Synthesis of new sulfonyl pyrrolidine derivatives as matrix metalloproteinase inhibitors. Bioorg Med Chem 16:7932-8 (2008)  
Target
Name:
Aminopeptidase N
Synonyms:
AMPN_HUMAN APN Aminopeptidase CD_antigen=CD13 Myeloid plasma membrane glycoprotein CD13 gp150 | hAPN
Type:
PROTEIN
Mol. Mass.:
109522.63
Organism:
Homo sapiens (Human)
Description:
ChEMBL_1507526
Residue:
967
  
Inhibitor
Name:
BDBM50247539
Synonyms:
CHEMBL472915 N-((3S,5S)-1-(3-(3,4-dimethoxyphenyl)acryloyl)-5-(hydroxycarbamoyl)pyrrolidin-3-yl)nicotinamide
Type:
Small organic molecule
Emp. Form.:
C22H24N4O6
Mol. Mass.:
440.4492
SMILES:
COc1ccc(\C=C\C(=O)N2C[C@H](C[C@H]2C(=O)NO)NC(=O)c2cccnc2)cc1OC
: