Target
B1 bradykinin receptor
Ligand
BDBM50264721
Substrate
Meas. Tech.
ChEMBL_492574 (CHEMBL952241)
Ki
0.69±n/a nM
Citation
 Kuduk, SDChang, RKDipardo, RMDi Marco, CNMurphy, KLRansom, RWReiss, DRTang, CPrueksaritanont, TPettibone, DJBock, MG Bradykinin B1 receptor antagonists: an alpha-hydroxy amide with an improved metabolism profile. Bioorg Med Chem Lett 18:5107-10 (2008)  
Target
Name:
B1 bradykinin receptor
Synonyms:
B1 BRADYKININ B1R BK-1 receptor BRADYB1 | Bradykinin B1 receptor
Type:
Enzyme
Mol. Mass.:
40508.87
Organism:
Homo sapiens (Human)
Description:
P46663
Residue:
353
  
Inhibitor
Name:
BDBM50264721
Synonyms:
3-Hydroxy-1,1-dioxo-tetrahydro-1lambda*6*-thiophene-3-carboxylic acid ((R)-1-{5-[5-chloro-3-fluoro-2-(2-methyl-2H-tetrazol-5-yl)-phenyl]-3-fluoro-pyridin-2-yl}-ethyl)-amide | CHEMBL482829
Type:
Small organic molecule
Emp. Form.:
C20H19ClF2N6O4S
Mol. Mass.:
512.917
SMILES:
C[C@@H](NC(=O)C1(O)CCS(=O)(=O)C1)c1ncc(cc1F)-c1cc(Cl)cc(F)c1-c1nnn(C)n1
: