Target
Mast/stem cell growth factor receptor Kit
Ligand
BDBM50264392
Substrate
Meas. Tech.
ChEMBL_535203 (CHEMBL990799)
IC50
1±n/a nM
Citation
 Kunz, RKRumfelt, SChen, NZhang, DTasker, ASBürli, RHungate, RYu, VNguyen, YWhittington, DAMeagher, KLPlant, MTudor, YSchrag, MXu, YNg, GYHu, E Discovery of amido-benzisoxazoles as potent c-Kit inhibitors. Bioorg Med Chem Lett 18:5115-7 (2008)  
Target
Name:
Mast/stem cell growth factor receptor Kit
Synonyms:
CD117 antigen KIT Mast/stem cell growth factor receptor Kit (cKIT) Proto-oncogene tyrosine-protein kinase Kit Stem cell growth factor receptor Tyrosine-protein kinase Kit c-kit v-kit Hardy-Zuckerman 4 feline sarcoma viral oncogene homolog
Type:
Protein
Mol. Mass.:
109869.37
Organism:
Homo sapiens (Human)
Description:
P10721
Residue:
976
  
Inhibitor
Name:
BDBM50264392
Synonyms:
CHEMBL490823 | N-(6-acetamidopyridin-3-yl)-6-chloro-3-(3-(trifluoromethyl)phenylamino)benzo[d]isoxazole-7-carboxamide
Type:
Small organic molecule
Emp. Form.:
C22H15ClF3N5O3
Mol. Mass.:
489.834
SMILES:
CC(=O)Nc1ccc(NC(=O)c2c(Cl)ccc3c(Nc4cccc(c4)C(F)(F)F)noc23)cn1
: