Target
Mast/stem cell growth factor receptor Kit
Ligand
BDBM50264389
Substrate
Meas. Tech.
ChEMBL_535203 (CHEMBL990799)
IC50
3±n/a nM
Citation
 Kunz, RKRumfelt, SChen, NZhang, DTasker, ASBürli, RHungate, RYu, VNguyen, YWhittington, DAMeagher, KLPlant, MTudor, YSchrag, MXu, YNg, GYHu, E Discovery of amido-benzisoxazoles as potent c-Kit inhibitors. Bioorg Med Chem Lett 18:5115-7 (2008)  
Target
Name:
Mast/stem cell growth factor receptor Kit
Synonyms:
CD117 antigen KIT Mast/stem cell growth factor receptor Kit (cKIT) Proto-oncogene tyrosine-protein kinase Kit Stem cell growth factor receptor Tyrosine-protein kinase Kit c-kit v-kit Hardy-Zuckerman 4 feline sarcoma viral oncogene homolog
Type:
Protein
Mol. Mass.:
109869.37
Organism:
Homo sapiens (Human)
Description:
P10721
Residue:
976
  
Inhibitor
Name:
BDBM50264389
Synonyms:
6-chloro-N-(pyrimidin-5-yl)-3-(3-(trifluoromethyl)phenylamino)benzo[d]isoxazole-7-carboxamide CHEMBL491429
Type:
Small organic molecule
Emp. Form.:
C19H11ClF3N5O2
Mol. Mass.:
433.771
SMILES:
FC(F)(F)c1cccc(Nc2noc3c(C(=O)Nc4cncnc4)c(Cl)ccc23)c1
: