Target
Prostasin
Ligand
BDBM50246999
Substrate
Meas. Tech.
ChEMBL_557785 (CHEMBL953294)
Ki
19±n/a nM
Citation
 Tully, DCVidal, AChatterjee, AKWilliams, JARoberts, MJPetrassi, HMSpraggon, GBursulaya, BPacoma, RShipway, ASchumacher, AMDanahay, HHarris, JL Discovery of inhibitors of the channel-activating protease prostasin (CAP1/PRSS8) utilizing structure-based design. Bioorg Med Chem Lett 18:5895-9 (2008)  
Target
Name:
Prostasin
Synonyms:
PRSS8 | PRSS8_HUMAN
Type:
PROTEIN
Mol. Mass.:
36426.48
Organism:
Homo sapiens (Human)
Description:
ChEMBL_557785
Residue:
343
  
Inhibitor
Name:
BDBM50246999
Synonyms:
CHEMBL500474 | benzyl (R)-1-((2S,4R)-2-(((S)-6-amino-1-(benzo[d]oxazol-2-yl)-1-oxohexan-2-yl)carbamoyl)-4-(cyclohexylmethoxy)pyrrolidin-1-yl)-1-oxo-4-phenylbutan-2-ylcarbamate
Type:
Small organic molecule
Emp. Form.:
C43H53N5O7
Mol. Mass.:
751.9102
SMILES:
NCCCC[C@H](NC(=O)[C@@H]1C[C@H](CN1C(=O)[C@@H](CCc1ccccc1)NC(=O)OCc1ccccc1)OCC1CCCCC1)C(=O)c1nc2ccccc2o1
: