Target
Adenosine receptor A2a
Ligand
BDBM50264216
Substrate
Meas. Tech.
ChEMBL_535301 (CHEMBL982626)
Ki
1530±n/a nM
Citation
 Melman, AWang, BJoshi, BVGao, ZGCastro, SHeller, CLKim, SKJeong, LSJacobson, KA Selective A(3) adenosine receptor antagonists derived from nucleosides containing a bicyclo[3.1.0]hexane ring system. Bioorg Med Chem 16:8546-56 (2008)  
Target
Name:
Adenosine receptor A2a
Synonyms:
A2A adenosine receptor (hA2A) ADENOSINE A2 ADORA2 Adenosine A2A receptor (A2AAR)
Type:
G Protein-Coupled Receptor (GPCR)
Mol. Mass.:
44716.46
Organism:
Homo sapiens (Human)
Description:
P29274
Residue:
412
  
Inhibitor
Name:
BDBM50264216
Synonyms:
(1'R,2'R,3'S,4'R,5'S)-4'-[2-Chloro-6-(1-naphthylamino)-purine]-2',3'-O-dihydroxybicyclo-[3.1.0]hexane | CHEMBL490607
Type:
Small organic molecule
Emp. Form.:
C22H20ClN5O2
Mol. Mass.:
421.88
SMILES:
O[C@@H]1[C@@H]2C[C@@H]2[C@H]([C@@H]1O)n1cnc2c(NCc3cccc4ccccc34)nc(Cl)nc12
: