Target
Adenosine receptor A3
Ligand
BDBM50264213
Substrate
Meas. Tech.
ChEMBL_535303 (CHEMBL982628)
Ki
1.44±n/a nM
Citation
 Melman, AWang, BJoshi, BVGao, ZGCastro, SHeller, CLKim, SKJeong, LSJacobson, KA Selective A(3) adenosine receptor antagonists derived from nucleosides containing a bicyclo[3.1.0]hexane ring system. Bioorg Med Chem 16:8546-56 (2008)  
Target
Name:
Adenosine receptor A3
Synonyms:
A3 adenosine receptor (hA3) ADORA3 | Adenosine A3 receptor (A3AR)
Type:
G Protein-Coupled Receptor (GPCR)
Mol. Mass.:
36197.32
Organism:
Homo sapiens (Human)
Description:
P0DMS8
Residue:
318
  
Inhibitor
Name:
BDBM50264213
Synonyms:
(1'R,2'R,3'S,4'R,5'S)-4'-[2-Chloro-6-(3-iodobenzylamino)-purine]-2',3'-O-dihydroxybicyclo-[3.1.0]hexane CHEMBL490605
Type:
Small organic molecule
Emp. Form.:
C18H17ClIN5O2
Mol. Mass.:
497.717
SMILES:
O[C@@H]1[C@@H]2C[C@@H]2[C@H]([C@@H]1O)n1cnc2c(NCc3cccc(I)c3)nc(Cl)nc12
: