Target
Transcriptional activator protein TraR
Ligand
BDBM50266234
Substrate
Meas. Tech.
ChEMBL_543882 (CHEMBL1016857)
IC50
4700±n/a nM
Citation
 Geske, GDMattmann, MEBlackwell, HE Evaluation of a focused library of N-aryl L-homoserine lactones reveals a new set of potent quorum sensing modulators. Bioorg Med Chem Lett 18:5978-81 (2008)  
Target
Name:
Transcriptional activator protein TraR
Synonyms:
TRAR_RHIRD | traR
Type:
PROTEIN
Mol. Mass.:
26741.83
Organism:
Rhizobium radiobacter
Description:
ChEMBL_765233
Residue:
234
  
Inhibitor
Name:
BDBM50266234
Synonyms:
(S)-N-(2-oxotetrahydrofuran-3-yl)-2-(4-(trifluoromethylthio)phenyl)acetamide | CHEMBL458227
Type:
Small organic molecule
Emp. Form.:
C13H12F3NO3S
Mol. Mass.:
319.299
SMILES:
FC(F)(F)Sc1ccc(CC(=O)N[C@H]2CCOC2=O)cc1
: