Target
Mitogen-activated protein kinase 14
Ligand
BDBM50253906
Substrate
Meas. Tech.
ChEMBL_513348 (CHEMBL972711)
IC50
3±n/a nM
Citation
 Pierre Koch, naChristiane Bäuerlein, naHartmut Jank, naStefan Laufer, na Targeting the ribose and phosphate binding site of p38 mitogen-activated protein (MAP) kinase: synthesis and biological testing of 2-alkylsulfanyl-, 4(5)-aryl-, 5(4)-heteroaryl-substituted imidazoles. J Med Chem 51:5630-40 (2008)  
Target
Name:
Mitogen-activated protein kinase 14
Synonyms:
CSAID-binding protein CSBP1 CSPB1 MAP kinase 14 MAP kinase p38 alpha MAPK14 MK14_HUMAN Mitogen-activated protein kinase p38 alpha Stress-activated protein kinase 2a | p38 MAP kinase alpha/beta
Type:
Serine/threonine-protein kinase
Mol. Mass.:
41286.76
Organism:
Homo sapiens (Human)
Description:
Q16539
Residue:
360
  
Inhibitor
Name:
BDBM50253906
Synonyms:
3-(4-(4-Fluorophenyl)-5-(2-(isopropylamino)pyridin-4-yl)-1Himidazol-2-ylthio)propane-1,2-diol | CHEMBL459716
Type:
Small organic molecule
Emp. Form.:
C20H23FN4O2S
Mol. Mass.:
402.486
SMILES:
CC(C)Nc1cc(ccn1)-c1nc(SCC(O)CO)[nH]c1-c1ccc(F)cc1
: