Target
Polyphenol oxidase 2
Ligand
BDBM50264087
Substrate
Meas. Tech.
ChEMBL_535661 (CHEMBL987989)
IC50
730±n/a nM
Citation
 Oozeki, HTajima, RNihei, K Molecular design of potent tyrosinase inhibitors having the bibenzyl skeleton. Bioorg Med Chem Lett 18:5252-4 (2008)  
Target
Name:
Polyphenol oxidase 2
Synonyms:
Monophenol monooxygenase PPO2 Tyrosinase
Type:
Protein
Mol. Mass.:
63923.66
Organism:
Agaricus bisporus (Common mushroom)
Description:
O42713
Residue:
556
  
Inhibitor
Name:
BDBM50264087
Synonyms:
(2S,2'S,3R,3'R,4S,4'S,5R,5'R)-2,2'-(4-(2,4-dihydroxyphenethyl)-1,3-phenylene)bis(oxy)bis(tetrahydro-2H-pyran-3,4,5-triol) | CHEMBL489989
Type:
Small organic molecule
Emp. Form.:
C24H30O12
Mol. Mass.:
510.4878
SMILES:
O[C@@H]1CO[C@@H](Oc2ccc(CCc3ccc(O)cc3O)c(O[C@@H]3OC[C@@H](O)[C@H](O)[C@H]3O)c2)[C@H](O)[C@H]1O
: