Target
Polyphenol oxidase 2
Ligand
BDBM50264086
Substrate
Meas. Tech.
ChEMBL_535661 (CHEMBL987989)
IC50
430±n/a nM
Citation
 Oozeki, HTajima, RNihei, K Molecular design of potent tyrosinase inhibitors having the bibenzyl skeleton. Bioorg Med Chem Lett 18:5252-4 (2008)  
Target
Name:
Polyphenol oxidase 2
Synonyms:
Monophenol monooxygenase PPO2 Tyrosinase
Type:
Protein
Mol. Mass.:
63923.66
Organism:
Agaricus bisporus (Common mushroom)
Description:
O42713
Residue:
556
  
Inhibitor
Name:
BDBM50264086
Synonyms:
(2S,3R,4S,5R)-2-(4-(2,4-dihydroxyphenethyl)-3-hydroxyphenoxy)tetrahydro-2H-pyran-3,4,5-triol | CHEMBL491410
Type:
Small organic molecule
Emp. Form.:
C19H22O8
Mol. Mass.:
378.3732
SMILES:
O[C@@H]1CO[C@@H](Oc2ccc(CCc3ccc(O)cc3O)c(O)c2)[C@H](O)[C@H]1O
: