Target
D(3) dopamine receptor
Ligand
BDBM50253327
Substrate
Meas. Tech.
ChEMBL_539668 (CHEMBL1028976)
Ki
5.7±n/a nM
Citation
 Chen, JCollins, GTZhang, JYang, CYLevant, BWoods, JWang, S Design, synthesis, and evaluation of potent and selective ligands for the dopamine 3 (D3) receptor with a novel in vivo behavioral profile. J Med Chem 51:5905-8 (2008)  
Target
Name:
D(3) dopamine receptor
Synonyms:
DOPAMINE D3 Dopamine D3 receptor | Drd3
Type:
Protein
Mol. Mass.:
49540.58
Organism:
Rattus norvegicus (Rat)
Description:
P19020
Residue:
446
  
Inhibitor
Name:
BDBM50253327
Synonyms:
CHEMBL524005 | Naphthalene-2-carboxylic acid {4-[2-((R)-8-methoxy-1,2,4,4a,5,6-hexahydro-pyrazino[1,2-a]quinolin-3-yl)-ethyl]-cyclohexyl}-amide
Type:
Small organic molecule
Emp. Form.:
C32H39N3O2
Mol. Mass.:
497.671
SMILES:
COc1ccc2N3CCN(CC[C@H]4CC[C@@H](CC4)NC(=O)c4ccc5ccccc5c4)C[C@H]3CCc2c1
: