Target
D(2) dopamine receptor
Ligand
BDBM50253395
Substrate
Meas. Tech.
ChEMBL_539669 (CHEMBL1028977)
Ki
345±n/a nM
Citation
 Chen, JCollins, GTZhang, JYang, CYLevant, BWoods, JWang, S Design, synthesis, and evaluation of potent and selective ligands for the dopamine 3 (D3) receptor with a novel in vivo behavioral profile. J Med Chem 51:5905-8 (2008)  
Target
Name:
D(2) dopamine receptor
Synonyms:
DOPAMINE D2 DOPAMINE D2 Short Dopamine D2 receptor Drd2
Type:
G Protein-Coupled Receptor (GPCR)
Mol. Mass.:
50931.60
Organism:
Rattus norvegicus (rat)
Description:
P61169
Residue:
444
  
Inhibitor
Name:
BDBM50253395
Synonyms:
CHEMBL494309 | Naphthalene-2-carboxylic acid (4-{2-[((S)-2-amino-4,5,6,7-tetrahydro-benzothiazol-6-yl)-(3-methyl-butyl)-amino]-ethyl}-cyclohexyl)-amide
Type:
Small organic molecule
Emp. Form.:
C31H42N4OS
Mol. Mass.:
518.756
SMILES:
CC(C)CCN(CC[C@H]1CC[C@@H](CC1)NC(=O)c1ccc2ccccc2c1)[C@H]1CCc2nc(N)sc2C1
: