Target
Matrix metalloproteinase-9
Ligand
BDBM50265077
Substrate
Meas. Tech.
ChEMBL_497408 (CHEMBL1002949)
Ki
36±n/a nM
Citation
 Georgiadis, DYiotakis, A Specific targeting of metzincin family members with small-molecule inhibitors: progress toward a multifarious challenge. Bioorg Med Chem 16:8781-94 (2008)  
Target
Name:
Matrix metalloproteinase-9
Synonyms:
67 kDa matrix metalloproteinase-9 92 kDa gelatinase CLG4B Gelatinase B MMP9 Matrix metalloproteinase 9 (MMP-9) Matrix metalloproteinase-9 (MMP9)
Type:
Enzyme
Mol. Mass.:
78452.28
Organism:
Homo sapiens (Human)
Description:
P14780
Residue:
707
  
Inhibitor
Name:
BDBM50265077
Synonyms:
(S)-3-((S)-1-amino-3-(1H-indol-3-yl)-1-oxopropan-2-ylamino)-2-((2-methoxyphenylthio)methyl)-3-oxopropyl((R)-1-(benzyloxycarbonylamino)-2-phenylethyl)phosphinic acid | CHEMBL447457
Type:
Small organic molecule
Emp. Form.:
C38H41N4O7PS
Mol. Mass.:
728.794
SMILES:
COc1ccccc1SC[C@H](CP(O)(=O)[C@H](Cc1ccccc1)NC(=O)OCc1ccccc1)C(=O)N[C@@H](Cc1c[nH]c2ccccc12)C(N)=O
: