Target
72 kDa type IV collagenase
Ligand
BDBM50264811
Substrate
Meas. Tech.
ChEMBL_497403 (CHEMBL1002944)
Ki
110±n/a nM
Citation
 Georgiadis, DYiotakis, A Specific targeting of metzincin family members with small-molecule inhibitors: progress toward a multifarious challenge. Bioorg Med Chem 16:8781-94 (2008)  
Target
Name:
72 kDa type IV collagenase
Synonyms:
72 kDa gelatinase CLG4A Gelatinase A (MMP-2) MMP2_HUMAN Matrix metalloproteinase-2 (MMP 2) Matrix metalloproteinases 2 (MMP-2) | TBE-1
Type:
Enzyme
Mol. Mass.:
73870.36
Organism:
Homo sapiens (Human)
Description:
P08253
Residue:
660
  
Inhibitor
Name:
BDBM50264811
Synonyms:
CHEMBL485492 US10357546, ND-364
Type:
Small organic molecule
Emp. Form.:
C17H17NO4S2
Mol. Mass.:
363.451
SMILES:
CC(=O)Nc1ccc(Oc2ccc(cc2)S(=O)(=O)CC2CS2)cc1
: