Target
Matrilysin
Ligand
BDBM50265078
Substrate
Meas. Tech.
ChEMBL_497407 (CHEMBL1002948)
Ki
626±n/a nM
Citation
 Georgiadis, DYiotakis, A Specific targeting of metzincin family members with small-molecule inhibitors: progress toward a multifarious challenge. Bioorg Med Chem 16:8781-94 (2008)  
Target
Name:
Matrilysin
Synonyms:
MMP7 MPSL1 Matrix metalloproteinase-7 (MMP-7) PUMP1
Type:
Enzyme
Mol. Mass.:
29681.54
Organism:
Homo sapiens (Human)
Description:
P09237
Residue:
267
  
Inhibitor
Name:
BDBM50265078
Synonyms:
(4S)-5-amino-4-((2S)-2-((2S)-3-((4-bromophenyl)(hydroxy)phosphoryl)-2-((3-(3'-chlorobiphenyl-4-yl)isoxazol-5-yl)methyl)propanamido)-4-carboxybutanamido)-5-oxopentanoic acid | CHEMBL507420
Type:
Small organic molecule
Emp. Form.:
C35H35BrClN4O10P
Mol. Mass.:
818.004
SMILES:
NC(=O)[C@H](CCC(O)=O)NC(=O)[C@H](CCC(O)=O)NC(=O)[C@H](Cc1cc(no1)-c1ccc(cc1)-c1cccc(Cl)c1)CP(O)(=O)c1ccc(Br)cc1
: