Target
72 kDa type IV collagenase
Ligand
BDBM50265077
Substrate
Meas. Tech.
ChEMBL_497403 (CHEMBL1002944)
Ki
30±n/a nM
Citation
 Georgiadis, DYiotakis, A Specific targeting of metzincin family members with small-molecule inhibitors: progress toward a multifarious challenge. Bioorg Med Chem 16:8781-94 (2008)  
Target
Name:
72 kDa type IV collagenase
Synonyms:
72 kDa gelatinase CLG4A Gelatinase A (MMP-2) MMP2_HUMAN Matrix metalloproteinase-2 (MMP 2) Matrix metalloproteinases 2 (MMP-2) | TBE-1
Type:
Enzyme
Mol. Mass.:
73870.36
Organism:
Homo sapiens (Human)
Description:
P08253
Residue:
660
  
Inhibitor
Name:
BDBM50265077
Synonyms:
(S)-3-((S)-1-amino-3-(1H-indol-3-yl)-1-oxopropan-2-ylamino)-2-((2-methoxyphenylthio)methyl)-3-oxopropyl((R)-1-(benzyloxycarbonylamino)-2-phenylethyl)phosphinic acid | CHEMBL447457
Type:
Small organic molecule
Emp. Form.:
C38H41N4O7PS
Mol. Mass.:
728.794
SMILES:
COc1ccccc1SC[C@H](CP(O)(=O)[C@H](Cc1ccccc1)NC(=O)OCc1ccccc1)C(=O)N[C@@H](Cc1c[nH]c2ccccc12)C(N)=O
: