Target
Neutrophil collagenase
Ligand
BDBM50064344
Substrate
Meas. Tech.
ChEMBL_497405 (CHEMBL1002946)
Ki
17±n/a nM
Citation
 Georgiadis, DYiotakis, A Specific targeting of metzincin family members with small-molecule inhibitors: progress toward a multifarious challenge. Bioorg Med Chem 16:8781-94 (2008)  
Target
Name:
Neutrophil collagenase
Synonyms:
CLG1 MMP8 Matrix metalloproteinase-8 PMNL collagenase | PMNL-CL
Type:
Enzyme
Mol. Mass.:
53413.48
Organism:
Homo sapiens (Human)
Description:
P22894
Residue:
467
  
Inhibitor
Name:
BDBM50064344
Synonyms:
(3S,5R,14S)-14-(methylcarbamoyl)-2,8-dioxo-3-phenethyl-1,4,9-triazacyclotetradecane-5-carboxylic acid CHEMBL50228
Type:
Small organic molecule
Emp. Form.:
C22H32N4O5
Mol. Mass.:
432.5133
SMILES:
CNC(=O)[C@@H]1CCCCNC(=O)CC[C@@H](N[C@@H](CCc2ccccc2)C(=O)N1)C(O)=O
: