Target
Neutrophil collagenase
Ligand
BDBM50104963
Substrate
Meas. Tech.
ChEMBL_497405 (CHEMBL1002946)
Ki
171±n/a nM
Citation
 Georgiadis, DYiotakis, A Specific targeting of metzincin family members with small-molecule inhibitors: progress toward a multifarious challenge. Bioorg Med Chem 16:8781-94 (2008)  
Target
Name:
Neutrophil collagenase
Synonyms:
CLG1 MMP8 Matrix metalloproteinase-8 PMNL collagenase | PMNL-CL
Type:
Enzyme
Mol. Mass.:
53413.48
Organism:
Homo sapiens (Human)
Description:
P22894
Residue:
467
  
Inhibitor
Name:
BDBM50104963
Synonyms:
(2S,3R)-2-(cyclopropylmethylamino)-N1-hydroxy-N4-((1S,2R)-2-hydroxy-2,3-dihydro-1H-inden-1-yl)-3-(3-hydroxybenzyl)succinamide (R)-2-(Cyclopropylmethyl-amino)-N*1*-hydroxy-3-(3-hydroxy-benzyl)-N*4*-((3S,3aR)-2-hydroxy-indan-1-yl)-succinamide CHEMBL24398
Type:
Small organic molecule
Emp. Form.:
C24H29N3O5
Mol. Mass.:
439.5042
SMILES:
ONC(=O)[C@@H](NCC1CC1)[C@@H](Cc1cccc(O)c1)C(=O)N[C@@H]1[C@H](O)Cc2ccccc12
: