Target
Muscarinic acetylcholine receptor M1
Ligand
BDBM50263889
Substrate
Meas. Tech.
ChEMBL_536125 (CHEMBL983579)
EC50
356±n/a nM
Citation
 Bridges, TMBrady, AEKennedy, JPDaniels, RNMiller, NRKim, KBreininger, MLGentry, PRBrogan, JTJones, CKConn, PJLindsley, CW Synthesis and SAR of analogues of the M1 allosteric agonist TBPB. Part I: Exploration of alternative benzyl and privileged structure moieties. Bioorg Med Chem Lett 18:5439-42 (2008)  
Target
Name:
Muscarinic acetylcholine receptor M1
Synonyms:
ACM1_HUMAN Cholinergic receptor, muscarinic 1 | Cholinergic, muscarinic M1
Type:
Protein
Mol. Mass.:
51442.54
Organism:
Homo sapiens (Human)
Description:
P11229
Residue:
460
  
Inhibitor
Name:
BDBM50263889
Synonyms:
1-(1'-Benzyl-[1,4']bipiperidinyl-4-yl)-5-chloro-1,3-dihydro-benzoimidazol-2-one | CHEMBL490597
Type:
Small organic molecule
Emp. Form.:
C24H29ClN4O
Mol. Mass.:
424.966
SMILES:
Clc1ccc2n(C3CCN(CC3)C3CCN(Cc4ccccc4)CC3)c(=O)[nH]c2c1
: