Target
Muscarinic acetylcholine receptor M1
Ligand
BDBM50263837
Substrate
Meas. Tech.
ChEMBL_536125 (CHEMBL983579)
EC50
1030±n/a nM
Citation
 Bridges, TMBrady, AEKennedy, JPDaniels, RNMiller, NRKim, KBreininger, MLGentry, PRBrogan, JTJones, CKConn, PJLindsley, CW Synthesis and SAR of analogues of the M1 allosteric agonist TBPB. Part I: Exploration of alternative benzyl and privileged structure moieties. Bioorg Med Chem Lett 18:5439-42 (2008)  
Target
Name:
Muscarinic acetylcholine receptor M1
Synonyms:
ACM1_HUMAN Cholinergic receptor, muscarinic 1 | Cholinergic, muscarinic M1
Type:
Protein
Mol. Mass.:
51442.54
Organism:
Homo sapiens (Human)
Description:
P11229
Residue:
460
  
Inhibitor
Name:
BDBM50263837
Synonyms:
5-Chloro-1-[1'-(2-methyl-benzyl)-[1,4']bipiperidinyl-4-yl]-1,3-dihydro-benzoimidazol-2-one | CHEMBL523657
Type:
Small organic molecule
Emp. Form.:
C25H31ClN4O
Mol. Mass.:
438.993
SMILES:
Cc1ccccc1CN1CCC(CC1)N1CCC(CC1)n1c2ccc(Cl)cc2[nH]c1=O
: