Target
Inosine-5'-monophosphate dehydrogenase 1
Ligand
BDBM50275685
Substrate
Meas. Tech.
ChEMBL_496847 (CHEMBL998516)
Ki
10300±n/a nM
Citation
 Chen, LWilson, DJLabello, NPJayaram, HNPankiewicz, KW Mycophenolic acid analogs with a modified metabolic profile. Bioorg Med Chem 16:9340-5 (2008)  
Target
Name:
Inosine-5'-monophosphate dehydrogenase 1
Synonyms:
IMDH1_HUMAN IMPD 1 IMPDH-I Inosine Monophosphate Dehydrogenase Type 1 (IMPDH1) | Inosine-5'-monophosphate dehydrogenase (IMPDH)
Type:
Enzyme
Mol. Mass.:
55407.70
Organism:
Homo sapiens (Human)
Description:
Recombinant IMPDH1 expressed in E. coli.
Residue:
514
  
Inhibitor
Name:
BDBM50275685
Synonyms:
(E)-6-(2,4-dimethoxy-5-(oxazol-5-yl)phenyl)-4-methylhex-4-enoic acid CHEMBL443417
Type:
Small organic molecule
Emp. Form.:
C18H21NO5
Mol. Mass.:
331.363
SMILES:
COc1cc(OC)c(cc1C\C=C(/C)CCC(O)=O)-c1cnco1
: