Target
Adenosine receptor A1
Ligand
BDBM50252755
Substrate
Meas. Tech.
ChEMBL_539190 (CHEMBL1024694)
Ki
860±n/a nM
Citation
 Jeong, LSPal, SChoe, SAChoi, WJJacobson, KAGao, ZGKlutz, AMHou, XKim, HOLee, HWLee, SKTosh, DKMoon, HR Structure-activity relationships of truncated D- and l-4'-thioadenosine derivatives as species-independent A3 adenosine receptor antagonists. J Med Chem 51:6609-13 (2008)  
Target
Name:
Adenosine receptor A1
Synonyms:
A1 adenosine receptor (hA1) AA1R_HUMAN ADORA1 Adenosine A1-receptor Adenosine receptor A1 (hA1) | Adenosine transporter (AdT)
Type:
G Protein-Coupled Receptor (GPCR)
Mol. Mass.:
36520.92
Organism:
Homo sapiens (Human)
Description:
P30542
Residue:
326
  
Inhibitor
Name:
BDBM50252755
Synonyms:
(2R,3R,4S)-2-(6-(3-Chlorobenzylamino)-9H-purin-9-yl)-tetrahydrothiophene-3,4-diol | CHEMBL494086
Type:
Small organic molecule
Emp. Form.:
C16H16ClN5O2S
Mol. Mass.:
377.849
SMILES:
O[C@@H]1CS[C@H]([C@@H]1O)n1cnc2c(NCc3cccc(Cl)c3)ncnc12
: