Target
Adenosine receptor A2a
Ligand
BDBM50252717
Substrate
Meas. Tech.
ChEMBL_539461 (CHEMBL1028957)
Ki
1260±n/a nM
Citation
 Jeong, LSPal, SChoe, SAChoi, WJJacobson, KAGao, ZGKlutz, AMHou, XKim, HOLee, HWLee, SKTosh, DKMoon, HR Structure-activity relationships of truncated D- and l-4'-thioadenosine derivatives as species-independent A3 adenosine receptor antagonists. J Med Chem 51:6609-13 (2008)  
Target
Name:
Adenosine receptor A2a
Synonyms:
A2A adenosine receptor (hA2A) ADENOSINE A2 ADORA2 Adenosine A2A receptor (A2AAR)
Type:
G Protein-Coupled Receptor (GPCR)
Mol. Mass.:
44716.46
Organism:
Homo sapiens (Human)
Description:
P29274
Residue:
412
  
Inhibitor
Name:
BDBM50252717
Synonyms:
(2R,3R,4S)-2-(6-(3-Fluorobenzylamino)-9H-purin-9-yl)tetrahydrothiophene-3,4-diol | CHEMBL509055
Type:
Small organic molecule
Emp. Form.:
C16H16FN5O2S
Mol. Mass.:
361.394
SMILES:
O[C@@H]1CS[C@H]([C@@H]1O)n1cnc2c(NCc3cccc(F)c3)ncnc12
: