Target
Adenosine receptor A3
Ligand
BDBM50214975
Substrate
Meas. Tech.
ChEMBL_539463 (CHEMBL1028959)
Ki
36.2±n/a nM
Citation
 Jeong, LSPal, SChoe, SAChoi, WJJacobson, KAGao, ZGKlutz, AMHou, XKim, HOLee, HWLee, SKTosh, DKMoon, HR Structure-activity relationships of truncated D- and l-4'-thioadenosine derivatives as species-independent A3 adenosine receptor antagonists. J Med Chem 51:6609-13 (2008)  
Target
Name:
Adenosine receptor A3
Synonyms:
A3 adenosine receptor (hA3) ADORA3 | Adenosine A3 receptor (A3AR)
Type:
G Protein-Coupled Receptor (GPCR)
Mol. Mass.:
36197.32
Organism:
Homo sapiens (Human)
Description:
P0DMS8
Residue:
318
  
Inhibitor
Name:
BDBM50214975
Synonyms:
(2R,3R,4S)-2-(2-chloro-6-(3-fluorobenzylamino)-9H-purin-9-yl)tetrahydrothiophene-3,4-diol CHEMBL226581
Type:
Small organic molecule
Emp. Form.:
C16H15ClFN5O2S
Mol. Mass.:
395.839
SMILES:
O[C@@H]1CS[C@H]([C@@H]1O)n1cnc2c(NCc3cccc(F)c3)nc(Cl)nc12
: