Target
Adenosine receptor A3
Ligand
BDBM50252717
Substrate
Meas. Tech.
ChEMBL_539465 (CHEMBL1028961)
Ki
98±n/a nM
Citation
 Jeong, LSPal, SChoe, SAChoi, WJJacobson, KAGao, ZGKlutz, AMHou, XKim, HOLee, HWLee, SKTosh, DKMoon, HR Structure-activity relationships of truncated D- and l-4'-thioadenosine derivatives as species-independent A3 adenosine receptor antagonists. J Med Chem 51:6609-13 (2008)  
Target
Name:
Adenosine receptor A3
Synonyms:
AA3R_RAT Adenosine receptor A2a and A3 | Adora3
Type:
PROTEIN
Mol. Mass.:
36643.73
Organism:
Rattus norvegicus
Description:
ChEMBL_479910
Residue:
320
  
Inhibitor
Name:
BDBM50252717
Synonyms:
(2R,3R,4S)-2-(6-(3-Fluorobenzylamino)-9H-purin-9-yl)tetrahydrothiophene-3,4-diol | CHEMBL509055
Type:
Small organic molecule
Emp. Form.:
C16H16FN5O2S
Mol. Mass.:
361.394
SMILES:
O[C@@H]1CS[C@H]([C@@H]1O)n1cnc2c(NCc3cccc(F)c3)ncnc12
: