Target
Chitin synthase 1
Ligand
BDBM50231813
Substrate
Meas. Tech.
ChEMBL_539532 (CHEMBL1032341)
IC50
>400±n/a nM
Citation
 Escalante, AGattuso, MPérez, PZacchino, S Evidence for the mechanism of action of the antifungal phytolaccoside B isolated from Phytolacca tetramera Hauman. J Nat Prod 71:1720-5 (2008)  
Target
Name:
Chitin synthase 1
Synonyms:
CHS1 | CHS1_YEAST
Type:
PROTEIN
Mol. Mass.:
129864.18
Organism:
Saccharomyces cerevisiae
Description:
ChEMBL_539532
Residue:
1131
  
Inhibitor
Name:
BDBM50231813
Synonyms:
(2S,4aR,6aS,6bR,8aR,9R,10R,11S,12aR,12bR,14bS)-11-hydroxy-9-(hydroxymethyl)-2-(methoxycarbonyl)-2,6a,6b,9,12a-pentamethyl-10-((2S,3R,4S,5R)-3,4,5-trihydroxy-tetrahydro-2H-pyran-2-yloxy)-1,2,3,4,4a,5,6,6a,6b,7,8,8a,9,10,11,12,12a,12b,13,14b-icosahydropicene-4a-carboxylic acid CHEMBL258392
Type:
Small organic molecule
Emp. Form.:
C36H56O11
Mol. Mass.:
664.8232
SMILES:
COC(=O)[C@@]1(C)CC[C@@]2(CC[C@]3(C)C(=CC[C@@H]4[C@@]5(C)C[C@H](O)[C@H](O[C@@H]6OC[C@@H](O)[C@H](O)[C@H]6O)[C@@](C)(CO)[C@@H]5CC[C@@]34C)[C@@H]2C1)C(O)=O
: